{"text_format":"1","workbook":"xlsx","n_sheets":10,"sheets":["Invoice - Summary Page","Invoice - T.S. Results Summary","Invoice - Revenue Worksheet","Invoice - Cost Worksheet","Invoice - Direct Charge Costs","Invoice - Claim Calculation","Invoice - 20% Variance","DHCS Info","Non-Enhanced MAA Codes","Enhanced MAA Codes"],"not_rendered":{"charts":0,"images":2,"macros":1,"external_links":0,"defined_names":15,"comments":0,"pivot_tables":0},"unopened":[],"bounds":{"document_bytes":16777216,"sheet_cells":100000,"rows_first":2000,"rows_last":500,"rows_between":2000,"halvings":0,"cell_chars":16384,"cell_head_chars":4096},"cells_cut":0,"cells_raw":0,"read":"whole","date_system":"1900"}

{"sheet":"Invoice - Summary Page","index":0,"n_rows":28,"n_cols":12,"rows_kept":28,"cut":false,"hidden":false,"merged":[[26,0,26,2],[26,4,26,7],[25,0,25,11],[18,0,18,6],[20,0,20,6],[19,8,19,11],[24,0,24,5],[22,0,22,11],[21,0,21,11],[18,8,18,11],[7,3,7,5],[7,9,7,11],[6,0,6,11],[5,3,5,5],[23,0,23,5],[15,6,15,8],[17,8,17,11],[17,0,17,6],[7,7,7,8],[16,0,16,11],[10,1,10,4],[12,1,12,4],[14,1,14,4],[13,0,13,11],[0,0,0,11],[20,8,20,11],[11,0,11,11],[19,0,19,6],[2,0,2,11],[1,0,1,11],[3,3,3,5],[3,9,3,11],[3,7,3,8],[5,7,5,8],[8,0,8,11],[3,0,3,2],[5,0,5,2],[7,0,7,2],[4,0,4,11],[5,9,5,11]]}
["(delete this text) *PRINT ON LGA LETTER HEAD* (delete this text)"]
["COUNTY BASED MEDI-CAL ADMINISTRATIVE ACTIVITIES (CMAA) - SUMMARY INVOICE"]
[]
["Local Governmental Agency:",null,null,"ABC County",null,null,null,"Program/Department:",null,"Public Health"]
[]
["Contract Number:",null,null,"14-85697",null,null,null,"Claiming Unit:",null,"Outreach Program"]
[]
["Period of Service:",null,null,"07/01/2016 - 09/30/2016",null,null,null,"Invoice Number:",null,"16/17-1"]
[]
["COST CATEGORIES",null,null,null,null,{"$f":"IF(ISNUMBER(SEARCH(\"R\",J8)), \"Original Inv. Amt.\", \" \")","v":" "},null,null,null,{"$f":"IF(ISNUMBER(FIND(\"R\",J8)), \"Revised Inv. Amt.\", \" \")","v":" "}]
[null,"Total Amount to be Reimbursed at 50%",null,null,null,null,null,{"$f":"'Invoice - Claim Calculation'!E74","v":40561.761086405342},null,{"$f":"IF(F11>=1,F11-H11,\" \")","v":" "}]
[]
[null,"Total Amount to be Reimbursed at 75%",null,null,null,null,null,{"$f":"'Invoice - Claim Calculation'!F74","v":7697.7045953759944},null,{"$f":"IF(F13>=1, F13-H13, \" \")","v":" "}]
[]
[null,"Total amount of Fed. Govt. Reimbursement",null,null,null,null,null,{"$f":"'Invoice - Claim Calculation'!D74","v":48259.465681781337},null,{"$f":"IF(F15>=1, F15-H15, \" \")","v":" "},{"$f":"IF(J15<=-1,\"Due to the State\",\" \")","v":" "}]
{"$rows_left_out":14}
{"sheet":"Invoice - T.S. Results Summary","index":1,"n_rows":55,"n_cols":13,"rows_kept":55,"cut":false,"hidden":false,"merged":[[2,0,2,1],[2,2,2,4],[3,0,3,12],[4,1,4,6],[0,0,0,1],[0,2,0,4],[1,0,1,1],[1,2,1,4],[0,7,0,8],[1,7,1,8],[2,7,2,8],[0,9,0,11],[1,9,1,11],[2,9,2,11],[5,1,5,6],[6,1,6,6],[7,1,7,6],[8,1,8,6],[9,1,9,6],[10,1,10,6],[11,1,11,6],[12,1,12,6],[13,1,13,6],[14,1,14,6],[15,1,15,6],[16,1,16,6],[17,1,17,6],[18,1,18,6],[19,1,19,6],[20,1,20,6],[21,1,21,6],[22,1,22,6],[23,1,23,6],[24,1,24,6],[25,1,25,6],[26,1,26,6],[27,1,27,6],[28,1,28,6],[29,1,29,6],[45,0,45,2],[30,1,30,6],[31,1,31,6],[32,1,32,6],[33,1,33,6],[34,1,34,6],[48,6,48,8],[49,0,49,2],[49,6,49,8],[45,6,45,8],[35,1,35,6],[36,1,36,6],[40,0,40,12],[41,0,41,6],[41,7,41,12],[37,0,37,6],[44,10,44,12],[45,10,45,12],[42,0,42,12],[43,0,43,12],[44,0,44,2],[44,6,44,8],[54,9,54,12],[39,0,39,6],[38,0,38,6],[50,0,50,12],[51,0,51,12],[52,0,52,2],[52,6,52,8],[53,0,53,2],[53,6,53,8],[46,0,46,12],[48,10,48,12],[49,10,49,12],[53,10,53,12],[52,10,52,12],[47,0,47,12],[48,0,48,2]]}
["Local Governmental Agency:",null,{"$f":"'Invoice - Summary Page'!D4","v":"ABC County"},null,null,null,null,"Program/Department:",null,{"$f":"'Invoice - Summary Page'!J4","v":"Public Health"}]
["Contract Number:",null,{"$f":"'Invoice - Summary Page'!D6","v":"14-85697"},null,null,null,null,"Claiming Unit:",null,{"$f":"'Invoice - Summary Page'!J6","v":"Outreach Program"}]
["Period of Service:",null,{"$f":"'Invoice - Summary Page'!D8","v":"07/01/2016 - 09/30/2016"},null,null,null,null,"Invoice Number:",null,{"$f":"'Invoice - Summary Page'!J8","v":"16/17-1"}]
[]
["Code","Description",null,null,null,null,null,"SPMP\n Total Hours","SPMP\nActivity %","Non-SPMP\nTotal Hours","Non-SPMP\nActivity %","Medi-Cal %","Method\nUsed"]
[1,"Other Programs/Activities",null,null,null,null,null,248.5,{"$f":"IF(H38=0,0,H6/H38)","v":0.23694874851013112},76.75,{"$f":"IF(J38=0,0,J6/J38)","v":4.0052185257664713E-2}]
[2,"Direct Patient Care",null,null,null,null,null,null,{"$f":"IF(H38=0,0,H7/H38)","v":0},null,{"$f":"IF(J38=0,0,J7/J38)","v":0}]
[3,"Outreach to Non Medi-Cal Programs",null,null,null,null,null,null,{"$f":"IF(H38=0,0,H8/H38)","v":0},null,{"$f":"IF(J38=0,0,J8/J38)","v":0}]
[4,"Medi-Cal Outreach ",null,null,null,null,null,86.5,{"$f":"IF(H38=0,0,H9/H38)","v":8.247914183551848E-2},null,{"$f":"IF(J38=0,0,J9/J38)","v":0},1]
[5,"Referral, Coordination, and Monitoring of Non Medi-Cal Services",null,null,null,null,null,null,{"$f":"IF(H38=0,0,H10/H38)","v":0},null,{"$f":"IF(J38=0,0,J10/J38)","v":0}]
[6,"Referral, Coordination, and Monitoring of Medi-Cal Services",null,null,null,null,null,185.5,{"$f":"IF(H38=0,0,H11/H38)","v":0.17687723480333731},35.75,{"$f":"IF(J38=0,0,J11/J38)","v":1.8656229615133725E-2},0.42749999999999999,"ACC"]
[7,"Facilitating Non Med-Cal Application",null,null,null,null,null,null,{"$f":"IF(H38=0,0,H12/H38)","v":0},null,{"$f":"IF(J38=0,0,J12/J38)","v":0}]
[8,"Facilitating Med-Cal Application",null,null,null,null,null,null,{"$f":"IF(H38=0,0,H13/H38)","v":0},null,{"$f":"IF(J38=0,0,J13/J38)","v":0},1]
[9,"Arranging and/or Providing Non-Emergency, Non-Medical Transportation to a Non Medi-Cal Covered Service",null,null,null,null,null,null,{"$f":"IF(H38=0,0,H14/H38)","v":0},null,{"$f":"IF(J38=0,0,J14/J38)","v":0}]
[10,"Arranging and/or Providing Non-Emergency, Non-Medical Transportation to a Medi-Cal Covered Service",null,null,null,null,null,null,{"$f":"IF(H38=0,0,H15/H38)","v":0},null,{"$f":"IF(J38=0,0,J15/J38)","v":0},null,"ACC"]
{"$rows_left_out":41}
{"sheet":"Invoice - Revenue Worksheet","index":2,"n_rows":46,"n_cols":10,"rows_kept":46,"cut":false,"hidden":false,"merged":[[5,0,5,1],[6,0,6,1],[7,0,7,1],[8,0,8,1],[10,0,10,1],[9,0,9,1],[0,5,0,6],[1,5,1,6],[2,5,2,6],[0,7,0,9],[1,7,1,9],[2,7,2,9],[11,0,11,1],[12,0,12,1],[13,0,13,1],[14,0,14,1],[15,0,15,1],[16,0,16,1],[18,0,18,1],[17,0,17,1],[19,0,19,1],[20,0,20,1],[22,0,22,1],[34,0,34,1],[23,0,23,1],[24,0,24,1],[25,0,25,1],[26,0,26,1],[27,0,27,1],[28,0,28,1],[29,0,29,1],[30,0,30,1],[31,0,31,1],[32,0,32,1],[33,0,33,1],[42,6,43,9],[3,0,4,1],[3,2,4,2],[42,0,43,1],[44,0,44,1],[44,3,44,4],[42,3,43,4],[44,6,44,9],[41,0,41,9],[35,0,35,1],[36,0,36,1],[37,0,37,1],[38,0,38,1],[39,0,39,1],[40,0,40,1],[21,0,21,1]]}
["Local Governmental Agency:",{"$f":"'Invoice - Summary Page'!$D$4","v":"ABC County"},null,null,null,"Program:",null,{"$f":"'Invoice - Summary Page'!$J$4","v":"Public Health"}]
["Contract Number:",{"$f":"'Invoice - Summary Page'!$D$6","v":"14-85697"},null,null,null,"Claiming Unit:",null,{"$f":"'Invoice - Summary Page'!$J$6","v":"Outreach Program"}]
["Period of Service:",{"$f":"'Invoice - Summary Page'!$D$8","v":"07/01/2016 - 09/30/2016"},null,null,null,"Invoice #:",null,{"$f":"'Invoice - Summary Page'!$J$8","v":"16/17-1"}]
["SOURCE and DESCRIPTION",null,"Non Offset Funds","CP#1","CP#2","CP#3 (a & b)","CP#4","CP#5","CP#6","TOTAL"]
[null,null,null,"SPMP","Non-SPMP","Non-Claimable","Direct-Enhanced","Direct-Non-Enhanced","Allocated","(CPs 1 - 6)"]
["Medi-Cal Fees + Match"]
["MediCal reimbursement fees",null,null,null,null,50000,null,null,null,{"$f":"SUM(F7:I7)","v":50000}]
["Title XIX MAA Revenue",null,58350,null,null,null,null,null,null,{"$f":"SUM(F8:I8)","v":0}]
["Medi-Cal Reimbursement (% of Exp) Directly Observed Therapy",null,null,null,null,null,null,null,null,{"$f":"SUM(F9:I9)","v":0}]
["              Total Medi-Cal Fees + Match",null,{"$f":"SUM(C7:C9)","v":58350},null,null,{"$f":"SUM(F7:F9)","v":50000},{"$f":"SUM(G7:G9)","v":0},{"$f":"SUM(H7:H9)","v":0},{"$f":"SUM(I7:I9)","v":0},{"$f":"SUM(F10:I10)","v":50000}]
["Federal Grants + Match",null,null,null,null,null,null,null,null," "]
["Federal Outreach Grant",null,null,15000,null,null,null,null,null,{"$f":"SUM(D12:I12)","v":15000}]
["Local Required Match",null,null,7500,null,null,null,null,null,{"$f":"SUM(D13:I13)","v":7500}]
["Other Revenue",null,null,null,null,null,null,null,null,{"$f":"SUM(D14:I14)","v":0}]
["              Total Federal Grants + Match",null,{"$f":"SUM(C12:C14)","v":0},{"$f":"SUM(D12:D14)","v":22500},0,0,0,0,0,{"$f":"SUM(D15:I15)","v":22500}]
{"$rows_left_out":32}
{"sheet":"Invoice - Cost Worksheet","index":3,"n_rows":42,"n_cols":8,"rows_kept":42,"cut":false,"hidden":false,"merged":[[22,0,22,1],[23,0,23,1],[25,0,25,1],[37,0,37,1],[26,0,26,1],[27,0,27,1],[28,0,28,1],[29,0,29,1],[36,0,36,1],[30,0,30,1],[12,0,12,1],[38,0,38,7],[40,0,40,1],[39,0,39,1],[39,6,39,7],[40,6,40,7],[24,0,24,1],[13,0,13,1],[14,0,14,1],[15,0,15,1],[16,0,16,1],[17,0,17,1],[18,0,18,1],[19,0,19,1],[20,0,20,1],[21,0,21,1],[0,6,0,7],[1,6,1,7],[2,6,2,7],[3,0,5,1],[11,0,11,6],[6,0,6,6],[7,0,7,1],[8,0,8,1],[9,0,9,1],[10,0,10,1]]}
["Local Governmental Agency:",{"$f":"'Invoice - Summary Page'!D4","v":"ABC County"},null,null,null,"Program:",{"$f":"'Invoice - Summary Page'!J4","v":"Public Health"}]
["Contract Number:",{"$f":"'Invoice - Summary Page'!D6","v":"14-85697"},null,null,null,"Claiming Unit:",{"$f":"'Invoice - Summary Page'!J6","v":"Outreach Program"}]
["Period of Service:",{"$f":"'Invoice - Summary Page'!D8","v":"07/01/2016 - 09/30/2016"},null,null,null,"Invoice #:",{"$f":"'Invoice - Summary Page'!J8","v":"16/17-1"}]
["SELECTED ITEMS OF COST",null,"Cost Pool #1","Cost Pool #2","Cost Pool #3a","Cost Pool #5","Cost Pool #6"]
[null,null,"SPMP","Non-SPMP","Non-Claimable","Non-SPMP Dir. Charge","Allocated/Support"]
[null,null,"Costs","Costs","Costs","Other Costs","Costs"]
["SALARY COSTS",null,null,null,null,null,null,"TOTALS"]
["Wages/Salary:",null,46586.407000000007,35450.51999999999,31033.274999999998,null,51933,{"$f":"SUM(C8:G8)","v":165003.20199999999}]
["Benefits:",null,19965.603000000003,15193.079999999996,13299.975,null,22257,{"$f":"SUM(C9:G9)","v":70715.657999999996}]
["Personal Services Contracts:",null,null,null,null,null,null,{"$f":"SUM(C10:G10)","v":0}]
["TOTAL Compensation for Personal Services:",null,{"$f":"SUM(C8:C10)","v":66552.010000000009},{"$f":"SUM(D8:D10)","v":50643.599999999984},{"$f":"SUM(E8:E10)","v":44333.25},null,{"$f":"SUM(G8:G10)","v":74190},{"$f":"SUM(H8:H10)","v":235718.86}]
["NON-SALARY COSTS",null,null,null,null,null,null,"TOTALS"]
["See attached Other Costs worksheet",null,5294.74,1700,1400,null,48923.643593094988,{"$f":"SUM(C13:G13)","v":57318.383593094986}]
[null,null,null,null,null,null,null,{"$f":"SUM(C14:G14)","v":0}]
[null,null,null,null,null,null,null,0]
{"$rows_left_out":28}
{"sheet":"Invoice - Direct Charge Costs","index":4,"n_rows":53,"n_cols":15,"rows_kept":53,"cut":false,"hidden":false,"merged":[[43,0,43,3],[1,8,1,12],[1,1,1,2],[1,6,1,7],[2,1,2,2],[11,0,11,14],[10,0,10,5],[3,0,3,14],[23,0,23,5],[38,0,38,8],[43,9,43,14],[43,5,43,7],[0,1,0,2],[41,0,41,14],[0,6,0,7],[42,9,42,14],[32,0,32,8],[2,8,2,12],[42,5,42,7],[24,0,24,8],[0,8,0,12],[42,0,42,3],[37,0,37,5],[31,0,31,5],[2,6,2,7]]}
[null,"Local Governmental Agency:",null,{"$f":"'Invoice - Summary Page'!$D$4","v":"ABC County"},null,null,"Program:",null,{"$f":"'Invoice - Summary Page'!$J$4","v":"Public Health"}]
[null,"Contract Number:",null,{"$f":"'Invoice - Summary Page'!$D$6","v":"14-85697"},null,null,"Claiming Unit:",null,{"$f":"'Invoice - Summary Page'!$J$6","v":"Outreach Program"}]
[null,"Period of Service:",null,{"$f":"'Invoice - Summary Page'!$D$8","v":"07/01/2016 - 09/30/2016"},null,null,"Invoice #:",null,{"$f":"'Invoice - Summary Page'!$J$8","v":"16/17-1"}]
["ENHANCED (SPMP) MAA STAFF COSTS"]
["Staff Member","Classification","Code","Description","Medi-Cal %","Activity %\nResults","Salary Costs","MAA\nClaimable\nPortion","Non\nClaimable\nPortion","Benefits\nCosts","MAA\nClaimable\nPortion","Non\nClaimable\nPortion","Non-Salary Costs","MAA\nClaimable\nPortion","Non\nClaimable\nPortion"]
[null,null,null,{"$f":"LOOKUP(C6,ECodes,'Enhanced MAA Codes'!B2:B3)","v":{"$error":"#N/A"}},{"$f":"LOOKUP('Invoice - Direct Charge Costs'!C6,NECodes,'Non-Enhanced MAA Codes'!D2:D11)","v":{"$error":"#N/A"}},null,null,{"$f":"IF(C6=0,0,(G6*F6)*E6)","v":0},{"$f":"G6-H6","v":0},null,{"$f":"IF(C6=0,0,(J6*F6)*E6)","v":0},{"$f":"J6-K6","v":0},0,{"$f":"IF(C6=0,0,(M6*F6)*E6)","v":0},{"$f":"M6-N6","v":0}]
[null,null,null,{"$f":"LOOKUP(C7,ECodes,'Enhanced MAA Codes'!B2:B3)","v":{"$error":"#N/A"}},{"$f":"LOOKUP('Invoice - Direct Charge Costs'!C7,NECodes,'Non-Enhanced MAA Codes'!D2:D11)","v":{"$error":"#N/A"}},null,null,{"$f":"IF(C7=0,0,(G7*F7)*E7)","v":0},{"$f":"G7-H7","v":0},null,{"$f":"IF(C7=0,0,(J7*F7)*E7)","v":0},{"$f":"J7-K7","v":0},0,{"$f":"IF(C7=0,0,(M7*F7)*E7)","v":0},{"$f":"M7-N7","v":0}]
[null,null,null,{"$f":"LOOKUP(C8,ECodes,'Enhanced MAA Codes'!B2:B3)","v":{"$error":"#N/A"}},{"$f":"LOOKUP('Invoice - Direct Charge Costs'!C8,NECodes,'Non-Enhanced MAA Codes'!D2:D11)","v":{"$error":"#N/A"}},null,0,{"$f":"IF(C8=0,0,(G8*F8)*E8)","v":0},{"$f":"G8-H8","v":0},0,{"$f":"IF(C8=0,0,(J8*F8)*E8)","v":0},{"$f":"J8-K8","v":0},0,{"$f":"IF(C8=0,0,(M8*F8)*E8)","v":0},{"$f":"M8-N8","v":0}]
[null,null,null,{"$f":"LOOKUP(C9,ECodes,'Enhanced MAA Codes'!B2:B3)","v":{"$error":"#N/A"}},{"$f":"LOOKUP('Invoice - Direct Charge Costs'!C9,NECodes,'Non-Enhanced MAA Codes'!D2:D11)","v":{"$error":"#N/A"}},null,0,{"$f":"IF(C9=0,0,(G9*F9)*E9)","v":0},{"$f":"G9-H9","v":0},0,{"$f":"IF(C9=0,0,(J9*F9)*E9)","v":0},{"$f":"J9-K9","v":0},0,{"$f":"IF(C9=0,0,(M9*F9)*E9)","v":0},{"$f":"M9-N9","v":0}]
[null,null,null,{"$f":"LOOKUP(C10,ECodes,'Enhanced MAA Codes'!B2:B3)","v":{"$error":"#N/A"}},{"$f":"LOOKUP('Invoice - Direct Charge Costs'!C10,NECodes,'Non-Enhanced MAA Codes'!D2:D11)","v":{"$error":"#N/A"}},null,0,{"$f":"IF(C10=0,0,(G10*F10)*E10)","v":0},{"$f":"G10-H10","v":0},0,{"$f":"IF(C10=0,0,(J10*F10)*E10)","v":0},{"$f":"J10-K10","v":0},0,{"$f":"IF(C10=0,0,(M10*F10)*E10)","v":0},{"$f":"M10-N10","v":0}]
["TOTALS",null,null,null,null,null,{"$f":"SUM(G6:G10)","v":0},0,0,0,0,0,0,{"$f":"SUM(N6:N10)","v":0},0]
["NON-ENHANCED MAA STAFF COSTS"]
["Staff Member","Classification","Code","Description","Medi-Cal %","Activity %\nResults","Salary Costs","MAA\nClaimable\nPortion","Non\nClaimable\nPortion","Benefits\nCosts","MAA\nClaimable\nPortion","Non\nClaimable\nPortion","Non-Salary Costs","MAA\nClaimable\nPortion","Non\nClaimable\nPortion"]
["Jim Morrison","MAA/TCM Coordinator",19,{"$f":"LOOKUP('Invoice - Direct Charge Costs'!C14,NECodes,'Non-Enhanced MAA Codes'!B2:B11)","v":"MAA/TCM Coordination and Claims Administration"},{"$f":"LOOKUP('Invoice - Direct Charge Costs'!C14,NECodes,'Non-Enhanced MAA Codes'!D2:D11)","v":1},1,7691.3549999999996,{"$f":"IF(C14=0,0,(G14*F14)*E14)","v":7691.3549999999996},{"$f":"G14-H14","v":0},3296.2949999999996,{"$f":"IF(C14=0,0,(J14*F14)*E14)","v":3296.2949999999996},{"$f":"J14-K14","v":0},{"$f":"4431.30390470088-1000","v":3431.3039047008797},{"$f":"IF(C14=0,0,(M14*F14)*E14)","v":3431.3039047008797},{"$f":"M14-N14","v":0}]
["Stevie Nicks","Accountant",19,{"$f":"LOOKUP('Invoice - Direct Charge Costs'!C15,NECodes,'Non-Enhanced MAA Codes'!B2:B11)","v":"MAA/TCM Coordination and Claims Administration"},{"$f":"LOOKUP('Invoice - Direct Charge Costs'!C15,NECodes,'Non-Enhanced MAA Codes'!D2:D11)","v":1},1,3024.7629999999999,3024.7629999999999,{"$f":"G15-H15","v":0},1296.327,{"$f":"IF(C15=0,0,(J15*F15)*E15)","v":1296.327},{"$f":"J15-K15","v":0},null,{"$f":"IF(C15=0,0,(M15*F15)*E15)","v":0},{"$f":"M15-N15","v":0}]
{"$rows_left_out":39}
{"sheet":"Invoice - Claim Calculation","index":5,"n_rows":80,"n_cols":8,"rows_kept":80,"cut":false,"hidden":false,"merged":[[76,0,76,7],[77,4,77,6],[78,4,78,6],[45,1,45,2],[45,5,45,6],[46,1,46,2],[46,5,46,6],[47,5,47,6],[49,6,50,6],[49,5,50,5],[49,7,50,7],[0,1,0,2],[1,1,1,2],[2,1,2,2],[0,5,0,6],[1,5,1,6],[2,5,2,6],[4,0,6,0],[23,0,25,0],[49,2,49,3],[49,1,50,1],[49,0,50,0],[47,1,47,2],[41,0,41,7],[42,4,42,6],[43,4,43,6],[49,4,50,4]]}
["Local Governmental Agency:",{"$f":"'Invoice - Summary Page'!$D$4","v":"ABC County"},null,null,"Program:",{"$f":"'Invoice - Summary Page'!$J$4","v":"Public Health"}]
["Contract Number:",{"$f":"'Invoice - Summary Page'!$D$6","v":"14-85697"},null,null,"Claiming Unit:",{"$f":"'Invoice - Summary Page'!$J$6","v":"Outreach Program"}]
["Period of Service:",{"$f":"'Invoice - Summary Page'!$D$8","v":"07/01/2016 - 09/30/2016"},null,null,"Invoice #:",{"$f":"'Invoice - Summary Page'!$J$8","v":"16/17-1"}]
[]
["COSTS:","Cost Pool #1","Cost Pool #2","Cost Pool #3a","Cost Pool #3b","Cost Pool #4","Cost Pool #5","Cost Pool #6"]
[null,"SPMP","Non-SPMP","Non-Claimable","Non-Claimable","SPMP","Non-SPMP","Allocated/Support"]
[null,"Costs","Costs","Costs","Dir. Charge Costs","Dir. Charge Costs","Dir. Charge Costs","Costs"]
["Salary:",{"$f":"'Invoice - Cost Worksheet'!C8","v":46586.407000000007},{"$f":"'Invoice - Cost Worksheet'!D8","v":35450.51999999999},{"$f":"'Invoice - Cost Worksheet'!E8","v":31033.274999999998},{"$f":"'Invoice - Direct Charge Costs'!I11+'Invoice - Direct Charge Costs'!I24","v":0},{"$f":"'Invoice - Direct Charge Costs'!H11","v":0},{"$f":"'Invoice - Direct Charge Costs'!H24","v":10716.117999999999},{"$f":"'Invoice - Cost Worksheet'!G8","v":51933}]
["Benefits:",{"$f":"'Invoice - Cost Worksheet'!C9","v":19965.603000000003},{"$f":"'Invoice - Cost Worksheet'!D9","v":15193.079999999996},{"$f":"'Invoice - Cost Worksheet'!E9","v":13299.975},{"$f":"'Invoice - Direct Charge Costs'!L11+'Invoice - Direct Charge Costs'!L24","v":0},{"$f":"'Invoice - Direct Charge Costs'!K11","v":0},{"$f":"'Invoice - Direct Charge Costs'!K24","v":4592.6219999999994},{"$f":"'Invoice - Cost Worksheet'!G9","v":22257}]
["Salary + Benefits SUBTOTAL:",{"$f":"B8+B9","v":66552.010000000009},50643.599999999984,44333.25,{"$f":"E8+E9","v":0},0,{"$f":"G8+G9","v":15308.739999999998},74190]
["Personal Service Contracts ",null,{"$f":"'Invoice - Cost Worksheet'!D10","v":0},{"$f":"'Invoice - Cost Worksheet'!E10","v":0},{"$f":"'Invoice - Direct Charge Costs'!I32","v":0},null,{"$f":"'Invoice - Direct Charge Costs'!H32","v":1000}]
["All Personnel Costs SUBTOTAL:",{"$f":"B10","v":66552.010000000009},{"$f":"SUM(C10:C11)","v":50643.599999999984},{"$f":"SUM(D10:D11)","v":44333.25},{"$f":"SUM(E10:E11)","v":0},{"$f":"F10","v":0},{"$f":"SUM(G10:G11)","v":16308.739999999998}]
["Personnel Costs Distribution Percentage:",{"$f":"IF(B12=0,0,(B12/(SUM(B12:G12))))","v":0.37422912814837817},{"$f":"IF(C12=0,0,(C12/(SUM(B12:G12))))","v":0.28477442340652365},{"$f":"IF(D12=0,0,(D12/(SUM(B12:G12))))","v":0.24929064494797504},{"$f":"IF(E12=0,0,(E12/(SUM(B12:G12))))","v":0},{"$f":"IF(F12=0,0,(F12/(SUM(B12:G12))))","v":0},{"$f":"IF(G12=0,0,(G12/(SUM(B12:G12))))","v":9.170580349712322E-2}]
["MAA Transportation Costs:",null,null,null,{"$f":"'Invoice - Direct Charge Costs'!I38","v":0},null,{"$f":"'Invoice - Direct Charge Costs'!H38","v":0}]
["Non-Salary Costs:",{"$f":"'Invoice - Cost Worksheet'!C38","v":5294.74},{"$f":"'Invoice - Cost Worksheet'!D38","v":1700},{"$f":"'Invoice - Cost Worksheet'!E38","v":1400},{"$f":"'Invoice - Direct Charge Costs'!O11+'Invoice - Direct Charge Costs'!O24","v":0},{"$f":"'Invoice - Direct Charge Costs'!N11","v":0},{"$f":"'Invoice - Direct Charge Costs'!N24","v":3431.3039047008797},{"$f":"'Invoice - Cost Worksheet'!G38","v":48923.643593094988}]
{"$rows_left_out":66}
{"sheet":"Invoice - 20% Variance","index":6,"n_rows":51,"n_cols":13,"rows_kept":51,"cut":false,"hidden":false,"merged":[[27,4,27,12],[38,1,38,12],[32,3,32,12],[33,3,33,12],[19,0,19,13],[20,0,20,13],[21,1,21,12],[22,3,22,12],[23,3,23,12],[41,1,41,12],[43,1,43,6],[43,8,43,9],[43,11,43,12],[39,1,39,12],[40,0,40,13],[42,1,42,6],[42,8,42,9],[42,11,42,12],[14,9,14,13],[45,1,45,6],[46,1,46,3],[46,4,46,8],[46,11,46,12],[36,3,36,12],[37,4,37,12],[34,3,34,12],[35,3,35,12],[44,1,44,6],[25,3,25,12],[26,3,26,12],[29,1,29,12],[28,1,28,12],[30,0,30,13],[31,1,31,12],[12,1,12,12],[24,3,24,12],[50,12,50,13],[1,4,1,12],[3,4,3,12],[4,4,4,12],[6,4,6,12],[7,4,7,12],[9,4,9,10],[9,11,9,12],[18,9,18,11],[18,12,18,13],[10,1,10,12],[11,1,11,12],[13,0,13,13],[14,0,14,7],[50,0,50,10],[49,0,49,13],[47,11,47,12],[48,11,48,12],[15,0,15,5],[48,4,48,8],[16,0,16,5],[17,0,17,5],[15,12,15,13],[16,12,16,13],[17,12,17,13],[17,6,17,7],[16,9,16,11],[17,9,17,11],[15,9,15,11],[18,6,18,7],[0,0,0,13],[18,0,18,5],[47,1,47,3],[48,1,48,3],[47,4,47,8],[1,1,1,3],[3,1,3,3],[6,1,6,3],[9,1,9,3],[2,0,2,13],[5,0,5,13],[8,0,8,13],[4,0,4,3],[7,0,7,3],[15,6,15,7],[16,6,16,7]]}
["(delete this text) *PRINT ON LGA LETTER HEAD* (delete this text)"]
[null,"Date:",null,null,"Date"]
[]
[null,"To:",null,null,"The Department of Health Care Services"]
[null,null,null,null,"County Based Medi-Cal Administrative Activities Unit"]
[]
[null,"From:",null,null,{"$f":"'Invoice - Summary Page'!D4","v":"ABC County"}]
[null,null,null,null,{"$f":"'Invoice - Summary Page'!J6","v":"Outreach Program"}]
[]
[null,"Subject:",null,null,"CMAA Program Invoice Percentage Variance Documentation for",null,null,null,null,null,null,{"$f":"'Invoice - Summary Page'!D8","v":"07/01/2016 - 09/30/2016"}]
[]
[]
[null,"The following information represents the CMAA Program invoice variance data for the LGA/Claiming Unit and Period of Service notated above."]
[]
["Prior Year Corresponding Quarter Variance Data",null,null,null,null,null,null,null,null,"Prior Quarter Variance Data"]
{"$rows_left_out":37}
{"sheet":"DHCS Info","index":7,"n_rows":20,"n_cols":3,"rows_kept":20,"cut":false,"hidden":true,"merged":[]}
["ps","th@tnew$"]
[12,2,"Medi-Cal"]
[16,2,"Grants"]
[20,2,"General"]
[24,2,"Medicare"]
[28,2,"Insurance"]
[32,2,"Fees"]
[36,2,"Revenue"]
[]
[]
[]
[]
["original"]
[12,4,"Medi-Cal"]
[18,4,"Grants"]
{"$rows_left_out":6}
{"sheet":"Non-Enhanced MAA Codes","index":8,"n_rows":11,"n_cols":4,"rows_kept":11,"cut":false,"hidden":true,"merged":[]}
["Code","Description","FFP\nRate","Medi-Cal %"]
[4,"Medi-Cal Outreach ","TM",{"$f":"'Invoice - T.S. Results Summary'!L9","v":1}]
[6,"Referral, Coordination, and Monitoring of Medi-Cal Services","PM",{"$f":"'Invoice - T.S. Results Summary'!L11","v":0.42749999999999999}]
[8,"Facilitating Med-Cal Application","TM",{"$f":"'Invoice - T.S. Results Summary'!L13","v":1}]
[10,"Arranging and/or Providing Non-Emergency, Non-Medical Transporation to a Medi-Cal Covered Service","PM",{"$f":"'Invoice - T.S. Results Summary'!L15","v":0}]
[12,"Contract Administration (A) for Medi-Cal Services specific for Medi-Cal populations","TM",{"$f":"'Invoice - T.S. Results Summary'!L17","v":1}]
[13,"Contract Administration (B) for Medi-Cal Services specific for Medi-Cal and Non Medi-Cal populations","PM",{"$f":"'Invoice - T.S. Results Summary'!L18","v":0.42749999999999999}]
[15,"Program Planning & Policy Development (A) (Non-enhanced) for Medi-Cal Services for Medi-Cal clients","TM",{"$f":"'Invoice - T.S. Results Summary'!L20","v":1}]
[17,"Program Planning & Policy Development (B) (Non-enhanced) for Medi-Cal Services for Medi-Cal and Non Medi-Cal clients","PM",{"$f":"'Invoice - T.S. Results Summary'!L22","v":0.42749999999999999}]
[19,"MAA/TCM Coordination and Claims Administration","TM",{"$f":"'Invoice - T.S. Results Summary'!L24","v":1}]
[20,"MAA/TCM Implementation Training","TM",{"$f":"'Invoice - T.S. Results Summary'!L25","v":1}]

{"sheet":"Enhanced MAA Codes","index":9,"n_rows":3,"n_cols":4,"rows_kept":3,"cut":false,"hidden":true,"merged":[]}
["Code","Description","FFP\nRate","Medi-Cal %"]
[16,"Program Planning & Policy Development Skilled Professional Medical Personnel (SPMP) (A) (Enhanced) for Medi-Cal Services for Medi-Cal clients","TM\n(Enhanced)",{"$f":"'Invoice - T.S. Results Summary'!L21","v":1}]
[18,"Program Planning & Policy Development (SPMP) (B) (Enhanced) for Medi-Cal Services for Medi-Cal and Non Medi-Cal clients","PM\n(Enhanced)",{"$f":"'Invoice - T.S. Results Summary'!L23","v":0.42749999999999999}]